[Bug 1597370] Re: ubuntu-defaults-builder fails to build in 16.04 LTS
Martin Pitt
martin.pitt at ubuntu.com
Fri Jul 1 09:06:35 UTC 2016
Hello Matthias, or anyone else affected,
Accepted ubuntu-defaults-builder into xenial-proposed. The package will
build now and be available at https://launchpad.net/ubuntu/+source
/ubuntu-defaults-builder/0.55~16.04 in a few hours, and then in the
-proposed repository.
Please help us by testing this new package. See
https://wiki.ubuntu.com/Testing/EnableProposed for documentation how to
enable and use -proposed. Your feedback will aid us getting this update
out to other Ubuntu users.
If this package fixes the bug for you, please add a comment to this bug,
mentioning the version of the package you tested, and change the tag
from verification-needed to verification-done. If it does not fix the
bug for you, please add a comment stating that, and change the tag to
verification-failed. In either case, details of your testing will help
us make a better decision.
Further information regarding the verification process can be found at
https://wiki.ubuntu.com/QATeam/PerformingSRUVerification . Thank you in
advance!
** Changed in: ubuntu-defaults-builder (Ubuntu Xenial)
Status: New => Fix Committed
** Tags added: verification-needed
--
You received this bug notification because you are a member of Ubuntu
Foundations Bugs, which is subscribed to ubuntu-defaults-builder in
Ubuntu.
https://bugs.launchpad.net/bugs/1597370
Title:
ubuntu-defaults-builder fails to build in 16.04 LTS
Status in ubuntu-defaults-builder package in Ubuntu:
Fix Released
Status in ubuntu-defaults-builder source package in Xenial:
Fix Committed
Bug description:
ubuntu-defaults-builder fails to build in 16.04 LTS, fixed in yakkety,
upload the yakkety version to xenial.
acceptance criteria: the package builds and passes the tests.
[...]
======================================================================
FAIL: test_webbrowser (__main__.T)
webbrowser/
----------------------------------------------------------------------
Traceback (most recent call last):
File "test/run", line 259, in test_webbrowser
self.build()
File "test/run", line 63, in build
self.fail('lintian errors:\n' + lintian)
AssertionError: lintian errors:
W: defaults-test source: out-of-date-standards-version 3.9.6 (current is 3.9.7)
----------------------------------------------------------------------
Ran 26 tests in 86.489s
FAILED (failures=19)
make[2]: *** [check] Error 1
Makefile:4: recipe for target 'check' failed
make[2]: Leaving directory '/«PKGBUILDDIR»'
To manage notifications about this bug go to:
https://bugs.launchpad.net/ubuntu/+source/ubuntu-defaults-builder/+bug/1597370/+subscriptions
More information about the foundations-bugs
mailing list