[Bug 1597597] Re: package libapache2-mod-php7.0 7.0.8-0ubuntu0.16.04.1 failed to install/upgrade: subprocess installed post-installation script returned error exit status 128
Jeremy Bicha
jbicha at linux.com
Thu Jun 30 22:22:01 UTC 2016
*** This bug is a duplicate of bug 1567291 ***
https://bugs.launchpad.net/bugs/1567291
Hmm, I'm going to mark this a duplicate of bug 1567291 since phpmyadmin
and debconf was involved there too.
** Description changed:
package libapache2-mod-php7.0 7.0.8-0ubuntu0.16.04.1 failed to
install/upgrade: subprocess installed post-installation script returned
error exit status 128
+
+ Use of uninitialized value $val in substitution (s///) at /usr/share/perl5/Debconf/Format/822.pm line 83, <GEN7> line 28.
+ Use of uninitialized value $val in concatenation (.) or string at /usr/share/perl5/Debconf/Format/822.pm line 84, <GEN7> line 28.
+ Setting up keyboard-configuration (1.108ubuntu15.2) ...
+ Use of uninitialized value $reply in scalar chomp at /usr/share/perl5/Debconf/FrontEnd/Passthrough.pm line 66.
+ Use of uninitialized value $reply in concatenation (.) or string at /usr/share/perl5/Debconf/FrontEnd/Passthrough.pm line 67.
+ Use of uninitialized value $reply in split at /usr/share/perl5/Debconf/FrontEnd/Passthrough.pm line 68.
+ Use of uninitialized value $reply in scalar chomp at /usr/share/perl5/Debconf/FrontEnd/Passthrough.pm line 66.
+ Use of uninitialized value $reply in concatenation (.) or string at /usr/share/perl5/Debconf/FrontEnd/Passthrough.pm line 67.
+ Use of uninitialized value $reply in split at /usr/share/perl5/Debconf/FrontEnd/Passthrough.pm line 68.
+ Use of uninitialized value $reply in scalar chomp at /usr/share/perl5/Debconf/FrontEnd/Passthrough.pm line 66.
+ Use of uninitialized value $reply in concatenation (.) or string at /usr/share/perl5/Debconf/FrontEnd/Passthrough.pm line 67.
+ Use of uninitialized value $reply in split at /usr/share/perl5/Debconf/FrontEnd/Passthrough.pm line 68.
+ Use of uninitialized value $ret in string eq at /usr/share/perl5/Debconf/FrontEnd/Passthrough.pm line 109.
+ dpkg: error processing package keyboard-configuration (--configure):
+ subprocess installed post-installation script returned error exit status 128
+ dpkg: dependency problems prevent configuration of console-setup-linux:
+ console-setup-linux depends on keyboard-configuration (= 1.108ubuntu15.2); however:
+ Package keyboard-configuration is not configured yet.
+
+ dpkg: error processing package console-setup-linux (--configure):
+ dependency problems - leaving unconfigured
+ dpkg: dependency problems prevent configuration of console-setup:
+ console-setup depends on console-setup-linux; however:
+ Package console-setup-linux is not configured yet.
+ console-setup depends on keyboard-configuration (= 1.108ubuntu15.2); however:
+ Package keyboard-configuration is not configured yet.
+
ProblemType: Package
DistroRelease: Ubuntu 16.04
Package: libapache2-mod-php7.0 7.0.8-0ubuntu0.16.04.1
ProcVersionSignature: Ubuntu 4.4.0-29.48-generic 4.4.13
Uname: Linux 4.4.0-29-generic x86_64
NonfreeKernelModules: nvidia_uvm nvidia wl
ApportVersion: 2.20.1-0ubuntu2.1
Architecture: amd64
Date: Thu Jun 30 11:20:52 2016
ErrorMessage: subprocess installed post-installation script returned error exit status 128
InstallationDate: Installed on 2016-02-23 (127 days ago)
InstallationMedia: Ubuntu 15.10 "Wily Werewolf" - Release amd64 (20151021)
RelatedPackageVersions:
- dpkg 1.18.4ubuntu1.1
- apt 1.2.12~ubuntu16.04.1
+ dpkg 1.18.4ubuntu1.1
+ apt 1.2.12~ubuntu16.04.1
SourcePackage: php7.0
Title: package libapache2-mod-php7.0 7.0.8-0ubuntu0.16.04.1 failed to install/upgrade: subprocess installed post-installation script returned error exit status 128
UpgradeStatus: Upgraded to xenial on 2016-04-22 (68 days ago)
** Tags removed: bot-stop-nagging
** Package changed: php7.0 (Ubuntu) => console-setup (Ubuntu)
** Changed in: console-setup (Ubuntu)
Status: Incomplete => New
** Also affects: debconf (Ubuntu)
Importance: Undecided
Status: New
** This bug has been marked a duplicate of bug 1567291
package phpmyadmin 4:4.4.13.1-1 failed to install/upgrade: subprocess installed pre-removal script returned error exit status 128
--
You received this bug notification because you are a member of Ubuntu
Foundations Bugs, which is subscribed to console-setup in Ubuntu.
https://bugs.launchpad.net/bugs/1597597
Title:
package libapache2-mod-php7.0 7.0.8-0ubuntu0.16.04.1 failed to
install/upgrade: subprocess installed post-installation script
returned error exit status 128
Status in console-setup package in Ubuntu:
New
Status in debconf package in Ubuntu:
New
Bug description:
package libapache2-mod-php7.0 7.0.8-0ubuntu0.16.04.1 failed to
install/upgrade: subprocess installed post-installation script
returned error exit status 128
Use of uninitialized value $val in substitution (s///) at /usr/share/perl5/Debconf/Format/822.pm line 83, <GEN7> line 28.
Use of uninitialized value $val in concatenation (.) or string at /usr/share/perl5/Debconf/Format/822.pm line 84, <GEN7> line 28.
Setting up keyboard-configuration (1.108ubuntu15.2) ...
Use of uninitialized value $reply in scalar chomp at /usr/share/perl5/Debconf/FrontEnd/Passthrough.pm line 66.
Use of uninitialized value $reply in concatenation (.) or string at /usr/share/perl5/Debconf/FrontEnd/Passthrough.pm line 67.
Use of uninitialized value $reply in split at /usr/share/perl5/Debconf/FrontEnd/Passthrough.pm line 68.
Use of uninitialized value $reply in scalar chomp at /usr/share/perl5/Debconf/FrontEnd/Passthrough.pm line 66.
Use of uninitialized value $reply in concatenation (.) or string at /usr/share/perl5/Debconf/FrontEnd/Passthrough.pm line 67.
Use of uninitialized value $reply in split at /usr/share/perl5/Debconf/FrontEnd/Passthrough.pm line 68.
Use of uninitialized value $reply in scalar chomp at /usr/share/perl5/Debconf/FrontEnd/Passthrough.pm line 66.
Use of uninitialized value $reply in concatenation (.) or string at /usr/share/perl5/Debconf/FrontEnd/Passthrough.pm line 67.
Use of uninitialized value $reply in split at /usr/share/perl5/Debconf/FrontEnd/Passthrough.pm line 68.
Use of uninitialized value $ret in string eq at /usr/share/perl5/Debconf/FrontEnd/Passthrough.pm line 109.
dpkg: error processing package keyboard-configuration (--configure):
subprocess installed post-installation script returned error exit status 128
dpkg: dependency problems prevent configuration of console-setup-linux:
console-setup-linux depends on keyboard-configuration (= 1.108ubuntu15.2); however:
Package keyboard-configuration is not configured yet.
dpkg: error processing package console-setup-linux (--configure):
dependency problems - leaving unconfigured
dpkg: dependency problems prevent configuration of console-setup:
console-setup depends on console-setup-linux; however:
Package console-setup-linux is not configured yet.
console-setup depends on keyboard-configuration (= 1.108ubuntu15.2); however:
Package keyboard-configuration is not configured yet.
ProblemType: Package
DistroRelease: Ubuntu 16.04
Package: libapache2-mod-php7.0 7.0.8-0ubuntu0.16.04.1
ProcVersionSignature: Ubuntu 4.4.0-29.48-generic 4.4.13
Uname: Linux 4.4.0-29-generic x86_64
NonfreeKernelModules: nvidia_uvm nvidia wl
ApportVersion: 2.20.1-0ubuntu2.1
Architecture: amd64
Date: Thu Jun 30 11:20:52 2016
ErrorMessage: subprocess installed post-installation script returned error exit status 128
InstallationDate: Installed on 2016-02-23 (127 days ago)
InstallationMedia: Ubuntu 15.10 "Wily Werewolf" - Release amd64 (20151021)
RelatedPackageVersions:
dpkg 1.18.4ubuntu1.1
apt 1.2.12~ubuntu16.04.1
SourcePackage: php7.0
Title: package libapache2-mod-php7.0 7.0.8-0ubuntu0.16.04.1 failed to install/upgrade: subprocess installed post-installation script returned error exit status 128
UpgradeStatus: Upgraded to xenial on 2016-04-22 (68 days ago)
To manage notifications about this bug go to:
https://bugs.launchpad.net/ubuntu/+source/console-setup/+bug/1597597/+subscriptions
More information about the foundations-bugs
mailing list