[Bug 1813586] [NEW] libnih ftbfs in 18.04 LTS (arm64 only)
Matthias Klose
doko at ubuntu.com
Mon Jan 28 12:30:49 UTC 2019
Public bug reported:
according to
http://people.canonical.com/~doko/ftbfs-report/test-rebuild-20181222-bionic.html
libnih ftbfs on arm64.
make check-TESTS
make[4]: Entering directory '/<<PKGBUILDDIR>>/nih-dbus'
make[5]: Entering directory '/<<PKGBUILDDIR>>/nih-dbus'
PASS: test_dbus_error 1 - nih_dbus_error_raise
PASS: test_dbus_error 2 - nih_dbus_error_raise_printf
make[5]: *** Deleting file 'test_dbus_connection.log'
Makefile:1239: recipe for target 'test_dbus_connection.log' failed
make[5]: *** [test_dbus_connection.log] Terminated
E: Caught signal ‘Terminated’: terminating immediately
debian/rules:31: recipe for target 'override_dh_auto_test' failed
make[1]: *** [override_dh_auto_test] Terminated
make[2]: *** wait: No child processes. Stop.
make[2]: *** Waiting for unfinished jobs....
make[2]: *** wait: No child processes. Stop.
Makefile:1211: recipe for target 'check-TESTS' failed
make[4]: *** [check-TESTS] Terminated
Makefile:1326: recipe for target 'check-am' failed
make[3]: *** [check-am] Terminated
debian/rules:6: recipe for target 'build-arch' failed
make: *** [build-arch] Terminated
Build killed with signal TERM after 150 minutes of inactivity
** Affects: libnih (Ubuntu)
Importance: High
Status: New
** Affects: libnih (Ubuntu Bionic)
Importance: High
Status: New
** Tags: ftbfs rls-bb-incoming
** Also affects: libnih (Ubuntu Bionic)
Importance: Undecided
Status: New
** Changed in: libnih (Ubuntu)
Importance: Undecided => High
** Changed in: libnih (Ubuntu Bionic)
Importance: Undecided => High
** Tags added: ftbfs rls-bb-incoming
--
You received this bug notification because you are a member of Ubuntu
Foundations Bugs, which is subscribed to libnih in Ubuntu.
https://bugs.launchpad.net/bugs/1813586
Title:
libnih ftbfs in 18.04 LTS (arm64 only)
Status in libnih package in Ubuntu:
New
Status in libnih source package in Bionic:
New
Bug description:
according to
http://people.canonical.com/~doko/ftbfs-report/test-rebuild-20181222-bionic.html
libnih ftbfs on arm64.
make check-TESTS
make[4]: Entering directory '/<<PKGBUILDDIR>>/nih-dbus'
make[5]: Entering directory '/<<PKGBUILDDIR>>/nih-dbus'
PASS: test_dbus_error 1 - nih_dbus_error_raise
PASS: test_dbus_error 2 - nih_dbus_error_raise_printf
make[5]: *** Deleting file 'test_dbus_connection.log'
Makefile:1239: recipe for target 'test_dbus_connection.log' failed
make[5]: *** [test_dbus_connection.log] Terminated
E: Caught signal ‘Terminated’: terminating immediately
debian/rules:31: recipe for target 'override_dh_auto_test' failed
make[1]: *** [override_dh_auto_test] Terminated
make[2]: *** wait: No child processes. Stop.
make[2]: *** Waiting for unfinished jobs....
make[2]: *** wait: No child processes. Stop.
Makefile:1211: recipe for target 'check-TESTS' failed
make[4]: *** [check-TESTS] Terminated
Makefile:1326: recipe for target 'check-am' failed
make[3]: *** [check-am] Terminated
debian/rules:6: recipe for target 'build-arch' failed
make: *** [build-arch] Terminated
Build killed with signal TERM after 150 minutes of inactivity
To manage notifications about this bug go to:
https://bugs.launchpad.net/ubuntu/+source/libnih/+bug/1813586/+subscriptions
More information about the foundations-bugs
mailing list