[Bug 1953262] [NEW] package lvm2 2.03.07-1ubuntu1 failed to install/upgrade: installed lvm2 package post-installation script subprocess returned error exit status 1

Ted Ooyevaar 1953262 at bugs.launchpad.net
Sun Dec 5 23:13:15 UTC 2021


Public bug reported:

Installing on MBP/M1 w/ARM processor, cored out while installing vagrant

Description:	Ubuntu 20.04.3 LTS
Release:	20.04


dpkg: error processing package lvm2 (--configure):
 installed lvm2 package post-installation script subprocess returned error exit status 1
dpkg: dependency problems prevent configuration of libguestfs0:arm64:
 libguestfs0:arm64 depends on lvm2; however:
  Package lvm2 is not configured yet.

dpkg: error processing package libguestfs0:arm64 (--configure):
 dependency problems - leaving unconfigured
No apport report written because the error message indicates its a followup error from a previous failure.
                                                                                                          dpkg: dependency problems prevent configuration of libguestfs-tools:
 libguestfs-tools depends on libguestfs0 (= 1:1.40.2-7ubuntu5); however:
  Package libguestfs0:arm64 is not configured yet.

dpkg: error processing package libguestfs-tools (--configure):
 dependency problems - leaving unconfigured
dpkg: dependency problems prevent configuration of libguestfs-xfs:arm64:
 libguestfs-xfs:arm64 depends on libguestfs0 (= 1:1.40.2-7ubuntu5); however:
  Package libguestfs0:arm64 is not configured yet.

dpkg: error processing package libguestfs-xfs:arm64 (--configure):
 dependency problems - leaving unconfigured
No apport report written because the error message indicates its a followup error from a previous failure.
                                                                                                          No apport report written because MaxReports is reached already
                                          dpkg: dependency problems prevent configuration of libguestfs-perl:
 libguestfs-perl depends on libguestfs0 (= 1:1.40.2-7ubuntu5); however:
  Package libguestfs0:arm64 is not configured yet.

dpkg: error processing package libguestfs-perl (--configure):
 dependency problems - leaving unconfigured
dpkg: dependency problems prevent configuration of libguestfs-hfsplus:arm64:
 libguestfs-hfsplus:arm64 depends on libguestfs0 (= 1:1.40.2-7ubuntu5); however:
  Package libguestfs0:arm64 is not configured yet.

dpkg: error processing package libguestfs-hfsplus:arm64 (--configure):
 dependency problems - leaving unconfigured
dpkg: dependency problems prevent configuration of libguestfs-reiserfs:arm64:
 libguestfs-reiserfs:arm64 depends on libguestfs0 (= 1:1.40.2-7ubuntu5); however:
  Package libguestfs0:arm64 is not configured yet.

dpkg: error processing package libguestfs-reiserfs:arm64 (--configure):
 dependency problems - leaving unconfigured
No apport report written because MaxReports is reached already
                                                              No apport report written because MaxReports is reached already
                                                                                                                            No apport report written because MaxReports is reached already
                                                            Processing triggers for initramfs-tools (0.136ubuntu6.6) ...
update-initramfs: Generating /boot/initrd.img-5.4.0-80-generic

Unsupported platform on EFI system, doing nothing.
Errors were encountered while processing:
 lvm2
 libguestfs0:arm64
 libguestfs-tools
 libguestfs-xfs:arm64
 libguestfs-perl
 libguestfs-hfsplus:arm64
 libguestfs-reiserfs:arm64
E: Sub-process /usr/bin/dpkg returned an error code (1)
W: Operation was interrupted before it could finish

ProblemType: Package
DistroRelease: Ubuntu 20.04
Package: lvm2 2.03.07-1ubuntu1
ProcVersionSignature: Ubuntu 5.4.0-80.90-generic 5.4.124
Uname: Linux 5.4.0-80-generic aarch64
NonfreeKernelModules: prl_fs_freeze prl_fs prl_tg
ApportVersion: 2.20.11-0ubuntu27.21
Architecture: arm64
CasperMD5CheckResult: pass
Date: Sun Dec  5 18:05:26 2021
ErrorMessage: installed lvm2 package post-installation script subprocess returned error exit status 1
InstallationDate: Installed on 2021-03-13 (267 days ago)
InstallationMedia: Ubuntu-Server 20.04.2 LTS "Focal Fossa" - Release arm64 (20210201.2)
Python3Details: /usr/bin/python3.8, Python 3.8.10, python3-minimal, 3.8.2-0ubuntu2
PythonDetails: N/A
RelatedPackageVersions:
 dpkg 1.19.7ubuntu3
 apt  2.0.6
SourcePackage: lvm2
Title: package lvm2 2.03.07-1ubuntu1 failed to install/upgrade: installed lvm2 package post-installation script subprocess returned error exit status 1
UpgradeStatus: No upgrade log present (probably fresh install)

** Affects: lvm2 (Ubuntu)
     Importance: Undecided
         Status: New


** Tags: apport-package arm64 focal need-duplicate-check

-- 
You received this bug notification because you are a member of Ubuntu
Foundations Bugs, which is subscribed to lvm2 in Ubuntu.
https://bugs.launchpad.net/bugs/1953262

Title:
  package lvm2 2.03.07-1ubuntu1 failed to install/upgrade: installed
  lvm2 package post-installation script subprocess returned error exit
  status 1

Status in lvm2 package in Ubuntu:
  New

Bug description:
  Installing on MBP/M1 w/ARM processor, cored out while installing
  vagrant

  Description:	Ubuntu 20.04.3 LTS
  Release:	20.04

  
  dpkg: error processing package lvm2 (--configure):
   installed lvm2 package post-installation script subprocess returned error exit status 1
  dpkg: dependency problems prevent configuration of libguestfs0:arm64:
   libguestfs0:arm64 depends on lvm2; however:
    Package lvm2 is not configured yet.

  dpkg: error processing package libguestfs0:arm64 (--configure):
   dependency problems - leaving unconfigured
  No apport report written because the error message indicates its a followup error from a previous failure.
                                                                                                            dpkg: dependency problems prevent configuration of libguestfs-tools:
   libguestfs-tools depends on libguestfs0 (= 1:1.40.2-7ubuntu5); however:
    Package libguestfs0:arm64 is not configured yet.

  dpkg: error processing package libguestfs-tools (--configure):
   dependency problems - leaving unconfigured
  dpkg: dependency problems prevent configuration of libguestfs-xfs:arm64:
   libguestfs-xfs:arm64 depends on libguestfs0 (= 1:1.40.2-7ubuntu5); however:
    Package libguestfs0:arm64 is not configured yet.

  dpkg: error processing package libguestfs-xfs:arm64 (--configure):
   dependency problems - leaving unconfigured
  No apport report written because the error message indicates its a followup error from a previous failure.
                                                                                                            No apport report written because MaxReports is reached already
                                            dpkg: dependency problems prevent configuration of libguestfs-perl:
   libguestfs-perl depends on libguestfs0 (= 1:1.40.2-7ubuntu5); however:
    Package libguestfs0:arm64 is not configured yet.

  dpkg: error processing package libguestfs-perl (--configure):
   dependency problems - leaving unconfigured
  dpkg: dependency problems prevent configuration of libguestfs-hfsplus:arm64:
   libguestfs-hfsplus:arm64 depends on libguestfs0 (= 1:1.40.2-7ubuntu5); however:
    Package libguestfs0:arm64 is not configured yet.

  dpkg: error processing package libguestfs-hfsplus:arm64 (--configure):
   dependency problems - leaving unconfigured
  dpkg: dependency problems prevent configuration of libguestfs-reiserfs:arm64:
   libguestfs-reiserfs:arm64 depends on libguestfs0 (= 1:1.40.2-7ubuntu5); however:
    Package libguestfs0:arm64 is not configured yet.

  dpkg: error processing package libguestfs-reiserfs:arm64 (--configure):
   dependency problems - leaving unconfigured
  No apport report written because MaxReports is reached already
                                                                No apport report written because MaxReports is reached already
                                                                                                                              No apport report written because MaxReports is reached already
                                                              Processing triggers for initramfs-tools (0.136ubuntu6.6) ...
  update-initramfs: Generating /boot/initrd.img-5.4.0-80-generic

  Unsupported platform on EFI system, doing nothing.
  Errors were encountered while processing:
   lvm2
   libguestfs0:arm64
   libguestfs-tools
   libguestfs-xfs:arm64
   libguestfs-perl
   libguestfs-hfsplus:arm64
   libguestfs-reiserfs:arm64
  E: Sub-process /usr/bin/dpkg returned an error code (1)
  W: Operation was interrupted before it could finish

  ProblemType: Package
  DistroRelease: Ubuntu 20.04
  Package: lvm2 2.03.07-1ubuntu1
  ProcVersionSignature: Ubuntu 5.4.0-80.90-generic 5.4.124
  Uname: Linux 5.4.0-80-generic aarch64
  NonfreeKernelModules: prl_fs_freeze prl_fs prl_tg
  ApportVersion: 2.20.11-0ubuntu27.21
  Architecture: arm64
  CasperMD5CheckResult: pass
  Date: Sun Dec  5 18:05:26 2021
  ErrorMessage: installed lvm2 package post-installation script subprocess returned error exit status 1
  InstallationDate: Installed on 2021-03-13 (267 days ago)
  InstallationMedia: Ubuntu-Server 20.04.2 LTS "Focal Fossa" - Release arm64 (20210201.2)
  Python3Details: /usr/bin/python3.8, Python 3.8.10, python3-minimal, 3.8.2-0ubuntu2
  PythonDetails: N/A
  RelatedPackageVersions:
   dpkg 1.19.7ubuntu3
   apt  2.0.6
  SourcePackage: lvm2
  Title: package lvm2 2.03.07-1ubuntu1 failed to install/upgrade: installed lvm2 package post-installation script subprocess returned error exit status 1
  UpgradeStatus: No upgrade log present (probably fresh install)

To manage notifications about this bug go to:
https://bugs.launchpad.net/ubuntu/+source/lvm2/+bug/1953262/+subscriptions




More information about the foundations-bugs mailing list