[Bug 1955804] [NEW] make and make test fail

Dorian Rosse 1955804 at bugs.launchpad.net
Mon Dec 27 11:44:37 UTC 2021


Public bug reported:

Hello,


make and make test fail like the printscreen following : 

CGO_LDFLAGS_ALLOW="-Wl,-wrap,.+" CGO_CFLAGS="-I/home/ubuntu/programs/libcap-2.32/libcap/include" CGO_LDFLAGS="-L/home/ubuntu/programs/libcap-2.32/libcap" GOPATH="/home/ubuntu/programs/libcap-2.32/go" go install libcap/psx
go install: version is required when current directory is not in a module
	Try 'go install libcap/psx at latest' to install the latest version
make[1]: *** [Makefile:37 : pkg/linux_amd64/libcap/psx.a] Erreur 1
make[1] : on quitte le répertoire « /home/ubuntu/programs/libcap-2.32/go »
make: *** [Makefile:13 : all] Erreur 2
root at ubuntu-ThinkPad-X250:/home/ubuntu/programs/libcap-2.32# go install libcap/psx at latest
go install: libcap/psx at latest: malformed module path "libcap/psx": missing dot in first path element
root at ubuntu-ThinkPad-X250:/home/ubuntu/programs/libcap-2.32# 

thank you in advance to help myself fully install your program,

Regards.


Dorian ROSSE.

** Affects: libcap2 (Ubuntu)
     Importance: Undecided
         Status: New

-- 
You received this bug notification because you are a member of Ubuntu
Foundations Bugs, which is subscribed to libcap2 in Ubuntu.
https://bugs.launchpad.net/bugs/1955804

Title:
  make and make test fail

Status in libcap2 package in Ubuntu:
  New

Bug description:
  Hello,

  
  make and make test fail like the printscreen following : 

  CGO_LDFLAGS_ALLOW="-Wl,-wrap,.+" CGO_CFLAGS="-I/home/ubuntu/programs/libcap-2.32/libcap/include" CGO_LDFLAGS="-L/home/ubuntu/programs/libcap-2.32/libcap" GOPATH="/home/ubuntu/programs/libcap-2.32/go" go install libcap/psx
  go install: version is required when current directory is not in a module
  	Try 'go install libcap/psx at latest' to install the latest version
  make[1]: *** [Makefile:37 : pkg/linux_amd64/libcap/psx.a] Erreur 1
  make[1] : on quitte le répertoire « /home/ubuntu/programs/libcap-2.32/go »
  make: *** [Makefile:13 : all] Erreur 2
  root at ubuntu-ThinkPad-X250:/home/ubuntu/programs/libcap-2.32# go install libcap/psx at latest
  go install: libcap/psx at latest: malformed module path "libcap/psx": missing dot in first path element
  root at ubuntu-ThinkPad-X250:/home/ubuntu/programs/libcap-2.32# 

  thank you in advance to help myself fully install your program,

  Regards.

  
  Dorian ROSSE.

To manage notifications about this bug go to:
https://bugs.launchpad.net/ubuntu/+source/libcap2/+bug/1955804/+subscriptions




More information about the foundations-bugs mailing list