[Bug 1922126] Re: autopkgtest fails in hirsute on some architectrures

Lukas Märdian 1922126 at bugs.launchpad.net
Tue May 4 10:54:51 UTC 2021


Works again, since we changed it back to NOT being in `big_packages`.

** Changed in: netplan.io (Ubuntu)
       Status: New => Fix Released

-- 
You received this bug notification because you are a member of Ubuntu
Foundations Bugs, which is subscribed to netplan.io in Ubuntu.
Matching subscriptions: foundations-bugs
https://bugs.launchpad.net/bugs/1922126

Title:
  autopkgtest fails in hirsute on some architectrures

Status in netplan.io package in Ubuntu:
  Fix Released

Bug description:
  https://autopkgtest.ubuntu.com/packages/n/netplan.io/hirsute/amd64

  https://objectstorage.prodstack4-5.canonical.com/v1/AUTH_77e2ada1e7a84929a74ba3b87153c0ac
  /autopkgtest-
  hirsute/hirsute/amd64/n/netplan.io/20210331_184259_fb0fb@/log.gz

  ...

  ======================================================================
  FAIL: test_manual_addresses (__main__.TestNetworkd)
  ----------------------------------------------------------------------
  Traceback (most recent call last):
    File "/tmp/autopkgtest.h8nQkB/build.GDW/src/tests/integration/ethernets.py", line 191, in test_manual_addresses
      self.assertIn(b'via 9876:bbbb::1',
  AssertionError: b'via 9876:bbbb::1' not found in b''

  ----------------------------------------------------------------------
  Ran 22 tests in 191.459s

  FAILED (failures=1, skipped=1)
  autopkgtest [17:45:49]: test ethernets: -----------------------]
  autopkgtest [17:45:50]: test ethernets:  - - - - - - - - - - results - - - - - - - - - -
  ethernets            FAIL non-zero exit status 1
  ...

To manage notifications about this bug go to:
https://bugs.launchpad.net/ubuntu/+source/netplan.io/+bug/1922126/+subscriptions



More information about the foundations-bugs mailing list