[Bug 1930295] [NEW] autopkgtest fails in Focal on armhf: kernel packages not matched: linux-tools-5.4.0-72-generic-lpae
Balint Reczey
1930295 at bugs.launchpad.net
Mon May 31 15:31:23 UTC 2021
Public bug reported:
https://autopkgtest.ubuntu.com/packages/unattended-upgrades/focal/armhf
https://autopkgtest.ubuntu.com/results/autopkgtest-focal/focal/armhf/u
/unattended-upgrades/20210513_204112_b792c@/log.gz
======================================================================
FAIL: test_versioned (__main__.TestKernelPatterns)
kernel package patterns should cover versioned packages
----------------------------------------------------------------------
Traceback (most recent call last):
File "test/autopkgtest_kernel_patterns.py", line 51, in test_versioned
self.assertTrue(not not_matched,
AssertionError: False is not true : kernel packages not matched: linux-tools-5.4.0-72-generic-lpae linux-modules-5.4.0-72-generic-lpae linux-image-5.4.0-72-generic-lpae linux-buildinfo-5.4.0-72-generic-lpae linux-image-unsigned-5.4.0-72-generic-lpae linux-headers-5.4.0-72-generic-lpae
----------------------------------------------------------------------
Ran 1 test in 1.277s
FAILED (failures=1)
** Affects: unattended-upgrades (Ubuntu)
Importance: Undecided
Status: New
** Tags: update-excuse-focal
--
You received this bug notification because you are a member of Ubuntu
Foundations Bugs, which is subscribed to unattended-upgrades in Ubuntu.
https://bugs.launchpad.net/bugs/1930295
Title:
autopkgtest fails in Focal on armhf: kernel packages not matched:
linux-tools-5.4.0-72-generic-lpae
Status in unattended-upgrades package in Ubuntu:
New
Bug description:
https://autopkgtest.ubuntu.com/packages/unattended-
upgrades/focal/armhf
https://autopkgtest.ubuntu.com/results/autopkgtest-focal/focal/armhf/u
/unattended-upgrades/20210513_204112_b792c@/log.gz
======================================================================
FAIL: test_versioned (__main__.TestKernelPatterns)
kernel package patterns should cover versioned packages
----------------------------------------------------------------------
Traceback (most recent call last):
File "test/autopkgtest_kernel_patterns.py", line 51, in test_versioned
self.assertTrue(not not_matched,
AssertionError: False is not true : kernel packages not matched: linux-tools-5.4.0-72-generic-lpae linux-modules-5.4.0-72-generic-lpae linux-image-5.4.0-72-generic-lpae linux-buildinfo-5.4.0-72-generic-lpae linux-image-unsigned-5.4.0-72-generic-lpae linux-headers-5.4.0-72-generic-lpae
----------------------------------------------------------------------
Ran 1 test in 1.277s
FAILED (failures=1)
To manage notifications about this bug go to:
https://bugs.launchpad.net/ubuntu/+source/unattended-upgrades/+bug/1930295/+subscriptions
More information about the foundations-bugs
mailing list