[Bug 2022154] [NEW] package libc6 2.35-0ubuntu3 failed to install/upgrade: new libc6:amd64 package pre-installation script subprocess returned error exit status 2

James Gray 2022154 at bugs.launchpad.net
Fri Jun 2 00:12:05 UTC 2023


Public bug reported:

installation failed

ProblemType: Package
DistroRelease: Ubuntu 22.04
Package: libc6 2.35-0ubuntu3
ProcVersionSignature: Ubuntu 5.15.0-25.25-generic 5.15.30
Uname: Linux 5.15.0-25-generic x86_64
NonfreeKernelModules: zfs zunicode zavl icp zcommon znvpair
ApportVersion: 2.20.11-0ubuntu82
Architecture: amd64
CasperMD5CheckMismatches: ./casper/filesystem.squashfs
CasperMD5CheckResult: fail
CasperVersion: 1.470
Date: Thu Jun  1 16:55:40 2023
DpkgTerminalLog:
 Preparing to unpack .../libc6_2.35-0ubuntu3.1_amd64.deb ...
 /var/lib/dpkg/tmp.ci/preinst: 44: 3: Bad file descriptor
 dpkg: error processing archive /var/cache/apt/archives/libc6_2.35-0ubuntu3.1_amd64.deb (--unpack):
  new libc6:amd64 package pre-installation script subprocess returned error exit status 2
DuplicateSignature:
 package:libc6:2.35-0ubuntu3
 Preparing to unpack .../libc6_2.35-0ubuntu3.1_amd64.deb ...
 /var/lib/dpkg/tmp.ci/preinst: 44: 3: Bad file descriptor
 dpkg: error processing archive /var/cache/apt/archives/libc6_2.35-0ubuntu3.1_amd64.deb (--unpack):
  new libc6:amd64 package pre-installation script subprocess returned error exit status 2
ErrorMessage: new libc6:amd64 package pre-installation script subprocess returned error exit status 2
LiveMediaBuild: Ubuntu 22.04 LTS "Jammy Jellyfish" - Release amd64 (20220419)
Python3Details: /usr/bin/python3.10, Python 3.10.4, python3-minimal, 3.10.4-0ubuntu2
PythonDetails: N/A
RelatedPackageVersions:
 dpkg 1.21.1ubuntu2
 apt  2.4.5
SourcePackage: glibc
Title: package libc6 2.35-0ubuntu3 failed to install/upgrade: new libc6:amd64 package pre-installation script subprocess returned error exit status 2
UpgradeStatus: No upgrade log present (probably fresh install)

** Affects: glibc (Ubuntu)
     Importance: Undecided
         Status: New


** Tags: amd64 apport-package jammy

-- 
You received this bug notification because you are a member of Ubuntu
Foundations Bugs, which is subscribed to glibc in Ubuntu.
https://bugs.launchpad.net/bugs/2022154

Title:
  package libc6 2.35-0ubuntu3 failed to install/upgrade: new libc6:amd64
  package pre-installation script subprocess returned error exit status
  2

Status in glibc package in Ubuntu:
  New

Bug description:
  installation failed

  ProblemType: Package
  DistroRelease: Ubuntu 22.04
  Package: libc6 2.35-0ubuntu3
  ProcVersionSignature: Ubuntu 5.15.0-25.25-generic 5.15.30
  Uname: Linux 5.15.0-25-generic x86_64
  NonfreeKernelModules: zfs zunicode zavl icp zcommon znvpair
  ApportVersion: 2.20.11-0ubuntu82
  Architecture: amd64
  CasperMD5CheckMismatches: ./casper/filesystem.squashfs
  CasperMD5CheckResult: fail
  CasperVersion: 1.470
  Date: Thu Jun  1 16:55:40 2023
  DpkgTerminalLog:
   Preparing to unpack .../libc6_2.35-0ubuntu3.1_amd64.deb ...
   /var/lib/dpkg/tmp.ci/preinst: 44: 3: Bad file descriptor
   dpkg: error processing archive /var/cache/apt/archives/libc6_2.35-0ubuntu3.1_amd64.deb (--unpack):
    new libc6:amd64 package pre-installation script subprocess returned error exit status 2
  DuplicateSignature:
   package:libc6:2.35-0ubuntu3
   Preparing to unpack .../libc6_2.35-0ubuntu3.1_amd64.deb ...
   /var/lib/dpkg/tmp.ci/preinst: 44: 3: Bad file descriptor
   dpkg: error processing archive /var/cache/apt/archives/libc6_2.35-0ubuntu3.1_amd64.deb (--unpack):
    new libc6:amd64 package pre-installation script subprocess returned error exit status 2
  ErrorMessage: new libc6:amd64 package pre-installation script subprocess returned error exit status 2
  LiveMediaBuild: Ubuntu 22.04 LTS "Jammy Jellyfish" - Release amd64 (20220419)
  Python3Details: /usr/bin/python3.10, Python 3.10.4, python3-minimal, 3.10.4-0ubuntu2
  PythonDetails: N/A
  RelatedPackageVersions:
   dpkg 1.21.1ubuntu2
   apt  2.4.5
  SourcePackage: glibc
  Title: package libc6 2.35-0ubuntu3 failed to install/upgrade: new libc6:amd64 package pre-installation script subprocess returned error exit status 2
  UpgradeStatus: No upgrade log present (probably fresh install)

To manage notifications about this bug go to:
https://bugs.launchpad.net/ubuntu/+source/glibc/+bug/2022154/+subscriptions




More information about the foundations-bugs mailing list