[Bug 831096] Re: avidemux version 1:2.5.4-0ubuntu7 failed to build in oneiric

Daniel van Vugt vanvugt at gmail.com
Tue Oct 18 05:03:16 UTC 2011


The Status for precise "avidemux (Ubuntu)" should probably be "In
Progress". It is certainly not even Fix Committed yet. That's why I'm
confused how we jumped to "Fix Released" already. There has been no
commit yet.

See:
lp:ubuntu/avidemux
https://code.launchpad.net/~vanvugt/ubuntu/precise/avidemux/fix-831096/+merge/79534

-- 
You received this bug notification because you are a member of Ubuntu
Sponsors Team, which is subscribed to the bug report.
https://bugs.launchpad.net/bugs/831096

Title:
  avidemux version 1:2.5.4-0ubuntu7 failed to build in oneiric

Status in “avidemux” package in Ubuntu:
  Fix Released
Status in “avidemux” source package in Oneiric:
  Confirmed

Bug description:
  avidemux version 1:2.5.4-0ubuntu7 failed to build in oneiric
  Link to failed build: https://launchpad.net/ubuntu/+archive/test-rebuild-20110816/+build/2688988

  Details about the rebuild:
  http://people.ubuntuwire.org/~wgrant/rebuild-ftbfs-test/test-rebuild-20110816-oneiric.html

  Direct link to the build log: https://launchpad.net/ubuntu/+archive
  /test-rebuild-20110816/+build/2688988/+files/buildlog_ubuntu-oneiric-
  amd64.avidemux_1%3A2.5.4-0ubuntu7_FAILEDTOBUILD.txt.gz

  This log snippet might be of interest, since it triggered the matcher 'Purging chroot-autobuild'.
  Excerpt 7786 lines into the build log:

  make[3]: Leaving directory `/build/buildd/avidemux-2.5.4/plugins/build'
  make[3]: Entering directory `/build/buildd/avidemux-2.5.4/plugins/build'
  [ 11%] Building C object ADM_videoEncoder/ADM_vidEnc_x264/CMakeFiles/ADM_vidEnc_x264.dir/interface.c.o
  [ 11%] Building CXX object ADM_videoEncoder/ADM_vidEnc_x264/CMakeFiles/ADM_vidEnc_x264.dir/configGuiLoader.cpp.o
  [ 11%] Building CXX object ADM_videoEncoder/ADM_vidEnc_x264/CMakeFiles/ADM_vidEnc_x264.dir/encoder.cpp.o
  /build/buildd/avidemux-2.5.4/plugins/ADM_videoEncoder/ADM_vidEnc_x264/encoder.cpp: In member function 'void x264Encoder::printParam(x264_param_t*)':
  /build/buildd/avidemux-2.5.4/plugins/ADM_videoEncoder/ADM_vidEnc_x264/encoder.cpp:492:48: error: 'x264_param_t' has no member named 'i_open_gop'
  make[3]: *** [ADM_videoEncoder/ADM_vidEnc_x264/CMakeFiles/ADM_vidEnc_x264.dir/encoder.cpp.o] Error 1
  make[3]: Leaving directory `/build/buildd/avidemux-2.5.4/plugins/build'
  make[2]: *** [ADM_videoEncoder/ADM_vidEnc_x264/CMakeFiles/ADM_vidEnc_x264.dir/all] Error 2
  make[2]: Leaving directory `/build/buildd/avidemux-2.5.4/plugins/build'
  make[1]: *** [all] Error 2
  make[1]: Leaving directory `/build/buildd/avidemux-2.5.4/plugins/build'
  make: *** [build-stamp] Error 2
  dpkg-buildpackage: error: debian/rules build gave error exit status 2
  ******************************************************************************
  Build finished at 20110819-2159
  FAILED [dpkg-buildpackage died]
  Purging chroot-autobuild/build/buildd/avidemux-2.5.4

To manage notifications about this bug go to:
https://bugs.launchpad.net/ubuntu/+source/avidemux/+bug/831096/+subscriptions



More information about the Ubuntu-sponsors mailing list